Reaction Details
TargetfMet-Leu-Phe receptor
LigandBDBM50419357
Substrate/Competitorn/a
Meas. Tech.ChEMBL_788190 (CHEMBL1919337)
IC50 1995±n/a nM
Citation Morley, ADCook, AKing, SRoberts, BLever, SWeaver, RMacdonald, CUnitt, JFagura, MPhillips, TLewis, RWenlock, M Discovery of pyrazoles as novel FPR1 antagonists. Bioorg Med Chem Lett21:6456-60 (2011) 
 
fMet-Leu-Phe receptor
Name:fMet-Leu-Phe receptor
Type:Enzyme Catalytic Domain
Mol. Mass.:38456.14
Organism:Homo sapiens (Human)
Description:gi_4503779
Residue:350
BDBM50419357
NameBDBM50419357
Synonyms:CHEMBL1916082
TypeSmall organic molecule
Emp. Form.C22H26N4O3S
Mol. Mass.426.532
SMILESCCC(CC)NC(=O)c1cnn(c1NS(=O)(=O)c1ccc(C)cc1)-c1ccccc1