Reaction Details
TargetfMet-Leu-Phe receptor
LigandBDBM50419389
Substrate/Competitorn/a
Meas. Tech.ChEMBL_788190 (CHEMBL1919337)
IC50 10000±n/a nM
Citation Morley, ADCook, AKing, SRoberts, BLever, SWeaver, RMacdonald, CUnitt, JFagura, MPhillips, TLewis, RWenlock, M Discovery of pyrazoles as novel FPR1 antagonists. Bioorg Med Chem Lett21:6456-60 (2011) 
 
fMet-Leu-Phe receptor
Name:fMet-Leu-Phe receptor
Type:Enzyme Catalytic Domain
Mol. Mass.:38456.14
Organism:Homo sapiens (Human)
Description:gi_4503779
Residue:350
BDBM50419389
NameBDBM50419389
Synonyms:CHEMBL1916268
TypeSmall organic molecule
Emp. Form.C19H28N4O3S
Mol. Mass.392.516
SMILESCCC(CC)NC(=O)c1cnn(C(C)C)c1NS(=O)(=O)c1ccc(C)cc1