Reaction Details
TargetfMet-Leu-Phe receptor
LigandBDBM50419370
Substrate/Competitorn/a
Meas. Tech.ChEMBL_788190 (CHEMBL1919337)
IC50 5012±n/a nM
Citation Morley, ADCook, AKing, SRoberts, BLever, SWeaver, RMacdonald, CUnitt, JFagura, MPhillips, TLewis, RWenlock, M Discovery of pyrazoles as novel FPR1 antagonists. Bioorg Med Chem Lett21:6456-60 (2011) 
 
fMet-Leu-Phe receptor
Name:fMet-Leu-Phe receptor
Type:Enzyme Catalytic Domain
Mol. Mass.:38456.14
Organism:Homo sapiens (Human)
Description:gi_4503779
Residue:350
BDBM50419370
NameBDBM50419370
Synonyms:CHEMBL1916267
TypeSmall organic molecule
Emp. Form.C23H28N4O3S
Mol. Mass.440.558
SMILESCCC(CC)NC(=O)c1cnn(Cc2ccccc2)c1NS(=O)(=O)c1ccc(C)cc1