Reaction Details
TargetfMet-Leu-Phe receptor
LigandBDBM50419360
Substrate/Competitorn/a
Meas. Tech.ChEMBL_788190 (CHEMBL1919337)
IC50 794±n/a nM
Citation Morley, ADCook, AKing, SRoberts, BLever, SWeaver, RMacdonald, CUnitt, JFagura, MPhillips, TLewis, RWenlock, M Discovery of pyrazoles as novel FPR1 antagonists. Bioorg Med Chem Lett21:6456-60 (2011) 
 
fMet-Leu-Phe receptor
Name:fMet-Leu-Phe receptor
Type:Enzyme Catalytic Domain
Mol. Mass.:38456.14
Organism:Homo sapiens (Human)
Description:gi_4503779
Residue:350
BDBM50419360
NameBDBM50419360
Synonyms:CHEMBL1916087
TypeSmall organic molecule
Emp. Form.C26H26N4O3S
Mol. Mass.474.575
SMILESCc1ccc(cc1)S(=O)(=O)Nc1c(cnn1-c1ccccc1)C(=O)NCc1ccc(C)cc1C