Reaction Details
TargetCytochrome P450 2C9
LigandBDBM50419355
Substrate/Competitorn/a
Meas. Tech.ChEMBL_788269 (CHEMBL1919532)
IC50<10000±n/a nM
Citation Morley, ADCook, AKing, SRoberts, BLever, SWeaver, RMacdonald, CUnitt, JFagura, MPhillips, TLewis, RWenlock, M Discovery of pyrazoles as novel FPR1 antagonists. Bioorg Med Chem Lett21:6456-60 (2011) 
 
Cytochrome P450 2C9
Name:Cytochrome P450 2C9
Type:Enzyme
Mol. Mass.:55636.33
Organism:Homo sapiens (Human)
Description:P11712
Residue:490
BDBM50419355
NameBDBM50419355
Synonyms:CHEMBL1916282
TypeSmall organic molecule
Emp. Form.C24H30N4O3S
Mol. Mass.454.585
SMILESC[C@H](NC(=O)c1c(C)nn(c1NS(=O)(=O)c1ccc(C)cc1)-c1ccccc1)C(C)(C)C