Reaction Details
TargetHistamine H3 receptor
LigandBDBM50419449
Substrate/Competitorn/a
Meas. Tech.ChEMBL_789899 (CHEMBL1925206)
Ki 4.9±n/a nM
Citation Istyastono, EPNijmeijer, SLim, HDvan de Stolpe, ARoumen, LKooistra, AJVischer, HFde Esch, IJLeurs, Rde Graaf, C Molecular determinants of ligand binding modes in the histamine H(4) receptor: linking ligand-based three-dimensional quantitative structure-activity relationship (3D-QSAR) models to in silico guided receptor mutagenesis studies. J Med Chem54:8136-47 (2011) 
 
Histamine H3 receptor
Name:Histamine H3 receptor
Type:G Protein-Coupled Receptor (GPCR)
Mol. Mass.:48691.47
Organism:Homo sapiens (Human)
Description:Binding assays were using CHO cells stably expressing hH3R receptors.
Residue:445
BDBM50419449
NameBDBM50419449
Synonyms:CHEMBL1923027
TypeSmall organic molecule
Emp. Form.C18H25ClN4S
Mol. Mass.364.936
SMILESCCCCN=C(NCc1ccc(Cl)cc1)SCCCc1cnc[nH]1