Reaction Details
TargetHistamine H3 receptor
LigandBDBM50419451
Substrate/Competitorn/a
Meas. Tech.ChEMBL_789899 (CHEMBL1925206)
Ki 32.36±n/a nM
Citation Istyastono, EPNijmeijer, SLim, HDvan de Stolpe, ARoumen, LKooistra, AJVischer, HFde Esch, IJLeurs, Rde Graaf, C Molecular determinants of ligand binding modes in the histamine H(4) receptor: linking ligand-based three-dimensional quantitative structure-activity relationship (3D-QSAR) models to in silico guided receptor mutagenesis studies. J Med Chem54:8136-47 (2011) 
 
Histamine H3 receptor
Name:Histamine H3 receptor
Type:G Protein-Coupled Receptor (GPCR)
Mol. Mass.:48691.47
Organism:Homo sapiens (Human)
Description:Binding assays were using CHO cells stably expressing hH3R receptors.
Residue:445
BDBM50419451
NameBDBM50419451
Synonyms:CHEMBL1923029
TypeSmall organic molecule
Emp. Form.C21H22Cl2N4S
Mol. Mass.433.397
SMILESClc1ccc(CNC(SCCCc2cnc[nH]2)=NCc2ccccc2)cc1Cl