Reaction Details
TargetHistamine H4 receptor
LigandBDBM50419454
Substrate/Competitorn/a
Meas. Tech.ChEMBL_789900 (CHEMBL1925207)
Ki 89.13±n/a nM
Citation Istyastono, EPNijmeijer, SLim, HDvan de Stolpe, ARoumen, LKooistra, AJVischer, HFde Esch, IJLeurs, Rde Graaf, C Molecular determinants of ligand binding modes in the histamine H(4) receptor: linking ligand-based three-dimensional quantitative structure-activity relationship (3D-QSAR) models to in silico guided receptor mutagenesis studies. J Med Chem54:8136-47 (2011) 
 
Histamine H4 receptor
Name:Histamine H4 receptor
Type:G Protein-Coupled Receptor (GPCR)
Mol. Mass.:44517.02
Organism:Homo sapiens (Human)
Description:Binding assays were using CHO cells stably expressing hH4R receptors.
Residue:390
BDBM50419454
NameBDBM50419454
Synonyms:CHEMBL1923032
TypeSmall organic molecule
Emp. Form.C18H24Cl2N4S
Mol. Mass.399.381
SMILESCCCCN=C(NCc1ccc(Cl)c(Cl)c1)SCCCc1cnc[nH]1