Reaction Details
TargetHistamine H4 receptor
LigandBDBM22566
Substrate/Competitorn/a
Meas. Tech.ChEMBL_789900 (CHEMBL1925207)
Ki 15.85±n/a nM
Citation Istyastono, EPNijmeijer, SLim, HDvan de Stolpe, ARoumen, LKooistra, AJVischer, HFde Esch, IJLeurs, Rde Graaf, C Molecular determinants of ligand binding modes in the histamine H(4) receptor: linking ligand-based three-dimensional quantitative structure-activity relationship (3D-QSAR) models to in silico guided receptor mutagenesis studies. J Med Chem54:8136-47 (2011) 
 
Histamine H4 receptor
Name:Histamine H4 receptor
Type:G Protein-Coupled Receptor (GPCR)
Mol. Mass.:44517.02
Organism:Homo sapiens (Human)
Description:Binding assays were using CHO cells stably expressing hH4R receptors.
Residue:390
BDBM22566
NameBDBM22566
Synonyms:5-chloro-2-[(4-methylpiperazin-1-yl)carbonyl]-1H-indole JNJ 7777120
TypeSmall organic molecule
Emp. Form.C14H16ClN3O
Mol. Mass.277.749
SMILESCN1CCN(CC1)C(=O)c1cc2cc(Cl)ccc2[nH]1