Reaction Details
TargetMuscarinic acetylcholine receptor M3
LigandBDBM50419469
Substrate/Competitorn/a
Meas. Tech.ChEMBL_789189 (CHEMBL1924273)
IC50 0.398±n/a nM
Citation Mete, ABowers, KChevalier, EDonald, DKEdwards, HEscott, KJFord, RGrime, KMillichip, ITeobald, BRussell, V The discovery of AZD9164, a novel muscarinic M3 antagonist. Bioorg Med Chem Lett21:7440-6 (2011) 
 
Muscarinic acetylcholine receptor M3
Name:Muscarinic acetylcholine receptor M3
Type:Enzyme
Mol. Mass.:66151.03
Organism:Homo sapiens (Human)
Description:P20309
Residue:590
BDBM50419469
NameBDBM50419469
Synonyms:CHEMBL1922057
TypeSmall organic molecule
Emp. Form.C29H36N3O3S
Mol. Mass.506.679
SMILESC[C@@](N1CCCCC1)(C(=O)O[C@H]1C[N+]2(Cc3cc(no3)-c3ccccc3)CCC1CC2)c1cccs1