Reaction Details
TargetMuscarinic acetylcholine receptor M3
LigandBDBM50419473
Substrate/Competitorn/a
Meas. Tech.ChEMBL_789189 (CHEMBL1924273)
IC50 0.2±n/a nM
Citation Mete, ABowers, KChevalier, EDonald, DKEdwards, HEscott, KJFord, RGrime, KMillichip, ITeobald, BRussell, V The discovery of AZD9164, a novel muscarinic M3 antagonist. Bioorg Med Chem Lett21:7440-6 (2011) 
 
Muscarinic acetylcholine receptor M3
Name:Muscarinic acetylcholine receptor M3
Type:Enzyme
Mol. Mass.:66151.03
Organism:Homo sapiens (Human)
Description:P20309
Residue:590
BDBM50419473
NameBDBM50419473
Synonyms:CHEMBL1922052
TypeSmall organic molecule
Emp. Form.C24H33N4O4S
Mol. Mass.473.608
SMILESC[C@@](N1CCCCC1)(C(=O)O[C@H]1C[N+]2(CC(=O)Nc3ccon3)CCC1CC2)c1cccs1