Reaction Details
TargetMuscarinic acetylcholine receptor M3
LigandBDBM50419485
Substrate/Competitorn/a
Meas. Tech.ChEMBL_789189 (CHEMBL1924273)
IC50 0.631±n/a nM
Citation Mete, ABowers, KChevalier, EDonald, DKEdwards, HEscott, KJFord, RGrime, KMillichip, ITeobald, BRussell, V The discovery of AZD9164, a novel muscarinic M3 antagonist. Bioorg Med Chem Lett21:7440-6 (2011) 
 
Muscarinic acetylcholine receptor M3
Name:Muscarinic acetylcholine receptor M3
Type:Enzyme
Mol. Mass.:66151.03
Organism:Homo sapiens (Human)
Description:P20309
Residue:590
BDBM50419485
NameBDBM50419485
Synonyms:CHEMBL1921936
TypeSmall organic molecule
Emp. Form.C30H40FN2O3
Mol. Mass.495.6481
SMILESC[C@@](N1CCCCC1)(C(=O)O[C@H]1C[N+]2(CCCOc3ccc(F)cc3)CCC1CC2)c1ccccc1