Reaction Details
TargetMuscarinic acetylcholine receptor M3
LigandBDBM50419522
Substrate/Competitorn/a
Meas. Tech.ChEMBL_789189 (CHEMBL1924273)
IC50 0.0316±n/a nM
Citation Mete, ABowers, KChevalier, EDonald, DKEdwards, HEscott, KJFord, RGrime, KMillichip, ITeobald, BRussell, V The discovery of AZD9164, a novel muscarinic M3 antagonist. Bioorg Med Chem Lett21:7440-6 (2011) 
 
Muscarinic acetylcholine receptor M3
Name:Muscarinic acetylcholine receptor M3
Type:Enzyme
Mol. Mass.:66151.03
Organism:Homo sapiens (Human)
Description:P20309
Residue:590
BDBM50419522
NameBDBM50419522
Synonyms:CHEMBL1924027
TypeSmall organic molecule
Emp. Form.C21H32NO2
Mol. Mass.330.4837
SMILESC[C@@](C1CCCC1)(C(=O)OC1CC[N+](C)(C)CC1)c1ccccc1