Reaction Details
TargetMuscarinic acetylcholine receptor M3
LigandBDBM50419533
Substrate/Competitorn/a
Meas. Tech.ChEMBL_789189 (CHEMBL1924273)
IC50 0.1±n/a nM
Citation Mete, ABowers, KChevalier, EDonald, DKEdwards, HEscott, KJFord, RGrime, KMillichip, ITeobald, BRussell, V The discovery of AZD9164, a novel muscarinic M3 antagonist. Bioorg Med Chem Lett21:7440-6 (2011) 
 
Muscarinic acetylcholine receptor M3
Name:Muscarinic acetylcholine receptor M3
Type:Enzyme
Mol. Mass.:66151.03
Organism:Homo sapiens (Human)
Description:P20309
Residue:590
BDBM50419533
NameBDBM50419533
Synonyms:CHEMBL1924036
TypeSmall organic molecule
Emp. Form.C19H31N2O2S
Mol. Mass.351.526
SMILESCC(N1CCCCC1)(C(=O)OC1CC[N+](C)(C)CC1)c1cccs1