Reaction Details
TargetBeta-2 adrenergic receptor
LigandBDBM50419668
Substrate/Competitorn/a
Meas. Tech.ChEMBL_800669 (CHEMBL1947791)
IC50 0.199526±n/a nM
Citation Alcaraz, LBailey, ACadogan, EConnolly, SJewell, RJordan, SKindon, NLister, ALawson, MMullen, ADainty, INicholls, DPaine, SPairaudeau, GStocks, MJThorne, PYoung, A From libraries to candidate: the discovery of new ultra long-acting dibasicß2-adrenoceptor agonists. Bioorg Med Chem Lett22:689-95 (2011) 
 
Beta-2 adrenergic receptor
Name:Beta-2 adrenergic receptor
Type:n/a
Mol. Mass.:46461.69
Organism:Homo sapiens (Human)
Description:P07550
Residue:413
BDBM50419668
NameBDBM50419668
Synonyms:CHEMBL1947157
TypeSmall organic molecule
Emp. Form.C26H27Cl2N3O3S
Mol. Mass.532.482
SMILESO[C@@H](CNCCc1cccc(CNCCc2c(Cl)cccc2Cl)c1)c1ccc(O)c2[nH]c(=O)sc12