Reaction Details
TargetBeta-2 adrenergic receptor
LigandBDBM50419669
Substrate/Competitorn/a
Meas. Tech.ChEMBL_800669 (CHEMBL1947791)
IC50 0.630957±n/a nM
Citation Alcaraz, LBailey, ACadogan, EConnolly, SJewell, RJordan, SKindon, NLister, ALawson, MMullen, ADainty, INicholls, DPaine, SPairaudeau, GStocks, MJThorne, PYoung, A From libraries to candidate: the discovery of new ultra long-acting dibasicß2-adrenoceptor agonists. Bioorg Med Chem Lett22:689-95 (2011) 
 
Beta-2 adrenergic receptor
Name:Beta-2 adrenergic receptor
Type:n/a
Mol. Mass.:46461.69
Organism:Homo sapiens (Human)
Description:P07550
Residue:413
BDBM50419669
NameBDBM50419669
Synonyms:CHEMBL1944690
TypeSmall organic molecule
Emp. Form.C26H28ClN3O3S
Mol. Mass.498.037
SMILESO[C@@H](CNCCc1cccc(CNCCc2ccccc2Cl)c1)c1ccc(O)c2[nH]c(=O)sc12