Reaction Details
TargetAlpha-1D adrenergic receptor
LigandBDBM50419672
Substrate/Competitorn/a
Meas. Tech.ChEMBL_800687 (CHEMBL1947809)
IC50 7.9±n/a nM
Citation Alcaraz, LBailey, ACadogan, EConnolly, SJewell, RJordan, SKindon, NLister, ALawson, MMullen, ADainty, INicholls, DPaine, SPairaudeau, GStocks, MJThorne, PYoung, A From libraries to candidate: the discovery of new ultra long-acting dibasicß2-adrenoceptor agonists. Bioorg Med Chem Lett22:689-95 (2011) 
 
Alpha-1D adrenergic receptor
Name:Alpha-1D adrenergic receptor
Type:Enzyme Catalytic Domain
Mol. Mass.:60485.82
Organism:Homo sapiens (Human)
Description:adrenergic Alpha1D ADRA1D HUMAN::P25100
Residue:572
BDBM50419672
NameBDBM50419672
Synonyms:CHEMBL1944694
TypeSmall organic molecule
Emp. Form.C27H31N3O4S
Mol. Mass.493.618
SMILESCOc1ccccc1CCNCc1ccc(CCNC[C@H](O)c2ccc(O)c3[nH]c(=O)sc23)cc1