Reaction Details
TargetNeuronal acetylcholine receptor subunit alpha-7
LigandBDBM50419732
Substrate/Competitorn/a
Meas. Tech.ChEMBL_801488 (CHEMBL1948415)
Ki 7943.28±n/a nM
Citation Edink, EAkdemir, AJansen, Cvan Elk, RZuiderveld, Ode Kanter, FJvan Muijlwijk-Koezen, JESmit, ABLeurs, Rde Esch, IJ Structure-based design, synthesis and structure-activity relationships of dibenzosuberyl- and benzoate-substituted tropines as ligands for acetylcholine-binding protein. Bioorg Med Chem Lett22:1448-54 (2012) 
 
Neuronal acetylcholine receptor subunit alpha-7
Name:Neuronal acetylcholine receptor subunit alpha-7
Type:n/a
Mol. Mass.:56448.33
Organism:Homo sapiens (Human)
Description: CHRNA7 (NACHRA7)
Residue:502
BDBM50419732
NameBDBM50419732
Synonyms:CHEMBL1947053
TypeSmall organic molecule
Emp. Form.C22H25NO2
Mol. Mass.335.4394
SMILESO=C(O[C@@H]1C[C@@H]2CC[C@H](C1)N2CCc1ccccc1)c1ccccc1