Reaction Details
TargetSoluble acetylcholine receptor
LigandBDBM50419732
Substrate/Competitorn/a
Meas. Tech.ChEMBL_801487 (CHEMBL1948414)
Ki 31.62±n/a nM
Citation Edink, EAkdemir, AJansen, Cvan Elk, RZuiderveld, Ode Kanter, FJvan Muijlwijk-Koezen, JESmit, ABLeurs, Rde Esch, IJ Structure-based design, synthesis and structure-activity relationships of dibenzosuberyl- and benzoate-substituted tropines as ligands for acetylcholine-binding protein. Bioorg Med Chem Lett22:1448-54 (2012) 
 
Soluble acetylcholine receptor
Name:Soluble acetylcholine receptor
Type:n/a
Mol. Mass.:26560.08
Organism:Aplysia Californica
Description:Q8WSF8
Residue:236
BDBM50419732
NameBDBM50419732
Synonyms:CHEMBL1947053
TypeSmall organic molecule
Emp. Form.C22H25NO2
Mol. Mass.335.4394
SMILESO=C(O[C@@H]1C[C@@H]2CC[C@H](C1)N2CCc1ccccc1)c1ccccc1