Reaction Details
TargetSolute carrier family 22 member 6
LigandBDBM4078
Substrate/Competitorn/a
Meas. Tech.ChEMBL_836526 (CHEMBL2077163)
IC50 270±n/a nM
Citation Whitley, ACSweet, DHWalle, T The dietary polyphenol ellagic acid is a potent inhibitor of hOAT1. Drug Metab Dispos33:1097-100 (2005) 
 
Solute carrier family 22 member 6
Name:Solute carrier family 22 member 6
Type:PROTEIN
Mol. Mass.:61831.78
Organism:Homo sapiens (Human)
Description:ChEMBL_1487359
Residue:563
BDBM4078
NameBDBM4078
Synonyms:6,7,13,14-tetrahydroxy-2,9-dioxatetracyclo[6.6.2.0^{4,16}.0^{11,15}]hexadeca-1(14),4(16),5,7,11(15),12-hexaene-3,10-dione ELLAGIC ACID Ellagic acid (18) MLS000069632 cid_5281855
TypeSmall organic molecule
Emp. Form.C14H6O8
Mol. Mass.302.1926
SMILESOc1cc2c3c(oc(=O)c4cc(O)c(O)c(oc2=O)c34)c1O