Reaction Details
TargetSolute carrier organic anion transporter family member 1A3
LigandBDBM50375594
Substrate/Competitorn/a
Meas. Tech.ChEMBL_838743 (CHEMBL2078569)
Ki 183000±n/a nM
Citation Takeuchi, AMasuda, SSaito, HHashimoto, YInui, K Trans-stimulation effects of folic acid derivatives on methotrexate transport by rat renal organic anion transporter, OAT-K1. J Pharmacol Exp Ther293:1034-9 (2000) Solute carrier organic anion transporter family member 1A3
Name:Solute carrier organic anion transporter family member 1A3
Type:PROTEIN
Mol. Mass.:73829.31
Organism:Rattus norvegicus
Description:ChEMBL_838743
Residue:670
BDBM50375594
NameBDBM50375594
Synonyms:TAUROCHOLATE
TypeSmall organic molecule
Emp. Form.C26H45NO7S
Mol. Mass.515.703
SMILESC[C@H](CCC(=O)NCCS(O)(=O)=O)[C@H]1CC[C@H]2[C@@H]3[C@H](O)C[C@@H]4C[C@H](O)CC[C@]4(C)[C@H]3C[C@H](O)[C@]12C