Reaction Details
TargetATP-binding cassette sub-family C member 5
LigandBDBM23620
Substrate/Competitorn/a
Meas. Tech.ChEMBL_836094 (CHEMBL2077530)
IC50 30000±n/a nM
Citation Reid, GWielinga, PZelcer, NDe Haas, MVan Deemter, LWijnholds, JBalzarini, JBorst, P Characterization of the transport of nucleoside analog drugs by the human multidrug resistance proteins MRP4 and MRP5. Mol Pharmacol63:1094-103 (2003) ATP-binding cassette sub-family C member 5
Name:ATP-binding cassette sub-family C member 5
Type:PROTEIN
Mol. Mass.:160694.29
Organism:Homo sapiens (Human)
Description:ChEMBL_836094
Residue:1437
BDBM23620
NameBDBM23620
Synonyms:2-({6-[bis(2-hydroxyethyl)amino]-4,8-bis(piperidin-1-yl)pyrimido[5,4-d][1,3]diazin-2-yl}(2-hydroxyethyl)amino)ethan-1-ol Dipyridamine Dipyudamine Persantine cid_3108
TypeSmall organic molecule
Emp. Form.C24H40N8O4
Mol. Mass.504.6256
SMILESOCCN(CCO)c1nc(N2CCCCC2)c2nc(nc(N3CCCCC3)c2n1)N(CCO)CCO