Reaction Details
TargetSolute carrier organic anion transporter family member 2A1
LigandBDBM50035622
Substrate/Competitorn/a
Meas. Tech.ChEMBL_836797 (CHEMBL2075322)
Ki 23±n/a nM
Citation Pucci, MLBao, YChan, BItoh, SLu, RCopeland, NGGilbert, DJJenkins, NASchuster, VL Cloning of mouse prostaglandin transporter PGT cDNA: species-specific substrate affinities. Am J Physiol277:734-41 (1999) 
 
Solute carrier organic anion transporter family member 2A1
Name:Solute carrier organic anion transporter family member 2A1
Type:Enzyme Catalytic Domain
Mol. Mass.:70068.67
Organism:Homo sapiens (Human)
Description:Prostaglandin Transporter 0 HUMAN::Q92959
Residue:643
BDBM50035622
NameBDBM50035622
Synonyms:(5Z,13E,15S)-9alpha,11alpha,15-trihydroxyprosta-5,13-dien-1-oic acid DINOPROST l-PGF2-alpha prostaglandin F2alpha
TypeSmall organic molecule
Emp. Form.C20H34O5
Mol. Mass.354.481
SMILESCCCCC[C@H](O)\C=C\[C@H]1[C@H](O)C[C@H](O)[C@@H]1C\C=C/CCCC(O)=O