Reaction Details
TargetSolute carrier family 22 member 6
LigandBDBM17638
Substrate/Competitorn/a
Meas. Tech.ChEMBL_838479 (CHEMBL2076050)
Ki 10000±n/a nM
Citation Apiwattanakul, NSekine, TChairoungdua, AKanai, YNakajima, NSophasan, SEndou, H Transport properties of nonsteroidal anti-inflammatory drugs by organic anion transporter 1 expressed in Xenopus laevis oocytes. Mol Pharmacol55:847-54 (1999) Solute carrier family 22 member 6
Name:Solute carrier family 22 member 6
Type:PROTEIN
Mol. Mass.:60784.17
Organism:Rattus norvegicus
Description:ChEMBL_838479
Residue:551
BDBM17638
NameBDBM17638
Synonyms:2-{1-[(4-chlorophenyl)carbonyl]-5-methoxy-2-methyl-1H-indol-3-yl}acetic acid Indocin US11478464, Compound Indomethacin US9271961, Indomethacin | indometacin
TypeSmall organic molecule
Emp. Form.C19H16ClNO4
Mol. Mass.357.788
SMILESCOc1ccc2n(C(=O)c3ccc(Cl)cc3)c(C)c(CC(O)=O)c2c1