Reaction Details
TargetSolute carrier organic anion transporter family member 1A1
LigandBDBM50366524
Substrate/Competitorn/a
Meas. Tech.ChEMBL_838286 (CHEMBL2076234)
Ki 1300±n/a nM
Citation Kanai, NLu, RBao, YWolkoff, AWVore, MSchuster, VL Estradiol 17 beta-D-glucuronide is a high-affinity substrate for oatp organic anion transporter. Am J Physiol270:326-31 (1996) 
 
Solute carrier organic anion transporter family member 1A1
Name:Solute carrier organic anion transporter family member 1A1
Type:PROTEIN
Mol. Mass.:74188.94
Organism:Rattus norvegicus
Description:ChEMBL_838286
Residue:670
BDBM50366524
NameBDBM50366524
Synonyms:ESTRONE Estrone 3-sulfate | Estrone Sulphate
TypeSmall organic molecule
Emp. Form.C18H22O5S
Mol. Mass.350.429
SMILESC[C@]12CC[C@H]3[C@@H](CCc4cc(OS(O)(=O)=O)ccc34)[C@@H]1CCC2=O