Reaction Details
TargetSolute carrier organic anion transporter family member 1A1
LigandBDBM50420249
Substrate/Competitorn/a
Meas. Tech.ChEMBL_838286 (CHEMBL2076234)
Ki 2400±n/a nM
Citation Kanai, NLu, RBao, YWolkoff, AWVore, MSchuster, VL Estradiol 17 beta-D-glucuronide is a high-affinity substrate for oatp organic anion transporter. Am J Physiol270:326-31 (1996) 
 
Solute carrier organic anion transporter family member 1A1
Name:Solute carrier organic anion transporter family member 1A1
Type:PROTEIN
Mol. Mass.:74188.94
Organism:Rattus norvegicus
Description:ChEMBL_838286
Residue:670
BDBM50420249
NameBDBM50420249
Synonyms:CHEMBL2074598
TypeSmall organic molecule
Emp. Form.C19H30O5S
Mol. Mass.370.504
SMILESC[C@]12CC[C@H]3[C@@H](CC[C@H]4C[C@@H](CC[C@]34C)OS(O)(=O)=O)[C@@H]1CCC2=O