Reaction Details
TargetSolute carrier organic anion transporter family member 2A1
LigandBDBM50420251
Substrate/Competitorn/a
Meas. Tech.ChEMBL_836139 (CHEMBL2077575)
Ki 3600±n/a nM
Citation Kanai, NLu, RSatriano, JABao, YWolkoff, AWSchuster, VL Identification and characterization of a prostaglandin transporter. Science268:866-869 (1995) Solute carrier organic anion transporter family member 2A1
Name:Solute carrier organic anion transporter family member 2A1
Type:Protein
Mol. Mass.:70404.97
Organism:Rattus norvegicus (Rat)
Description:Q00910
Residue:644
BDBM50420251
NameBDBM50420251
Synonyms:CHEMBL145704
TypeSmall organic molecule
Emp. Form.C21H14Br4O5S
Mol. Mass.698.014
SMILESCc1c(Br)c(O)c(Br)cc1C1(OS(=O)(=O)c2ccccc12)c1cc(Br)c(O)c(Br)c1C