Reaction Details
TargetCasein kinase I isoform alpha
LigandBDBM50420283
Substrate/Competitorn/a
Meas. Tech.ChEMBL_842102 (CHEMBL2091519)
IC50 142±n/a nM
Citation Yang, LLLi, GBYan, HXSun, QZMa, SJi, PWang, ZRFeng, SZou, JYang, SY Discovery of N6-phenyl-1H-pyrazolo[3,4-d]pyrimidine-3,6-diamine derivatives as novel CK1 inhibitors using common-feature pharmacophore model based virtual screening and hit-to-lead optimization. Eur J Med Chem56:30-38 (2012) 
 
Casein kinase I isoform alpha
Name:Casein kinase I isoform alpha
Type:Serine/threonine-protein kinase
Mol. Mass.:38936.59
Organism:Homo sapiens (Human)
Description:P48729
Residue:337
BDBM50420283
NameBDBM50420283
Synonyms:CHEMBL2089214
TypeSmall organic molecule
Emp. Form.C19H22N10O
Mol. Mass.406.4444
SMILESCC(C)(C)c1cc(NC(=O)Nc2cccc(Nc3ncc4c(N)[nH]nc4n3)c2)[nH]n1