Reaction Details
TargetMitogen-activated protein kinase 13
LigandBDBM50420759
Substrate/Competitorn/a
Meas. Tech.ChEMBL_842608 (CHEMBL2092446)
IC50 26±n/a nM
Citation Aiguadé, JBalagué, CCarranco, ICaturla, FDomínguez, MEastwood, PEsteve, CGonzález, JLumeras, WOrellana, APreciado, SRoca, RVidal, LVidal, B Novel triazolopyridylbenzamides as potent and selective p38a inhibitors. Bioorg Med Chem Lett22:3431-6 (2012) 
 
Mitogen-activated protein kinase 13
Name:Mitogen-activated protein kinase 13
Type:Enzyme
Mol. Mass.:42097.16
Organism:Homo sapiens (Human)
Description:O15264
Residue:365
BDBM50420759
NameBDBM50420759
Synonyms:CHEMBL2087504
TypeSmall organic molecule
Emp. Form.C20H20N4O
Mol. Mass.332.399
SMILESCc1ccc(cc1-c1ccn2c(nnc2c1)C1CC1)C(=O)NC1CC1