Reaction Details
TargetFarnesyl pyrophosphate synthase
LigandBDBM50421090
Substrate/Competitorn/a
Meas. Tech.ChEMBL_842483 (CHEMBL2092208)
IC50 115±n/a nM
Citation De Schutter, JWShaw, JLin, YSTsantrizos, YS Design of potent bisphosphonate inhibitors of the human farnesyl pyrophosphate synthase via targeted interactions with the active site 'capping' phenyls. Bioorg Med Chem20:5583-91 (2012) 
 
Farnesyl pyrophosphate synthase
Name:Farnesyl pyrophosphate synthase
Type:Enzyme
Mol. Mass.:48272.89
Organism:Homo sapiens (Human)
Description:P14324
Residue:419
BDBM50421090
NameBDBM50421090
Synonyms:CHEMBL2048247
TypeSmall organic molecule
Emp. Form.C13H16N2O7P2
Mol. Mass.374.2229
SMILESCOc1ccc(cc1)-c1ccnc(NC(P(O)(O)=O)P(O)(O)=O)c1