Reaction Details
Target5-hydroxytryptamine receptor 2A
LigandBDBM21392
Substrate/Competitorn/a
Meas. Tech.ChEMBL_201057 (CHEMBL805833)
IC50 21878±n/a nM
Citation Russell, MGCastro, JLMatassa, VGBeer, MSHeald, AScholey, KStanton, JABroughton, HB Synthesis and serotonergic activity of benzofuran and dihydrogenzofuran analogues of 5-carboxamidotryptamine. Bioorg Med Chem Lett4:1207-1212 (1994)    Article
 
5-hydroxytryptamine receptor 2A
Name:5-hydroxytryptamine receptor 2A
Type:G Protein-Coupled Receptor (GPCR)
Mol. Mass.:52852.05
Organism:Rattus norvegicus (rat)
Description:Rat cortex membranes 5-HT2A receptors.
Residue:471
BDBM21392
NameBDBM21392
Synonyms:3-(2-aminoethyl)-1H-indole-5-carboxamide 5-CT,DP CHEMBL1256863 [3H]-5-CT [3H]-5-Carboxyamidotryptamine | [3H]-5-carboxamidotryptamine
TypeSmall organic molecule
Emp. Form.C11H13N3O
Mol. Mass.203.2404
SMILESNCCc1c[nH]c2ccc(cc12)C(N)=O