Reaction Details
TargetIntegrin alpha-4/beta-1
LigandBDBM50087624
Substrate/Competitorn/a
Meas. Tech.ChEMBL_214662 (CHEMBL819076)
IC50 5.3±n/a nM
Citation Chen, LTilley, JWGuthrie, RWMennona, FHuang, TNKaplan, GTrilles, RMiklowski, DHuby, NSchwinge, VWolitzky, BRowan, K N-benzylpyroglutamyl-L-phenylalanine derivatives as VCAM/VLA-4 antagonists. Bioorg Med Chem Lett10:729-33 (2000) Integrin alpha-4/beta-1
Name:Integrin alpha-4/beta-1
Type:n/a
Mol. Mass.:n/a
Description:ASSAY_ID of EBI is 88912
Components:This complex has 2 components.
Component 1
Name:Integrin beta-1
Synonyms:CD_antigen=CD29 Fibronectin receptor beta GPIIA ITGB1 MDF2 | MSK12
Type:Enzyme
Mol. Mass.:88400.38
Organism:Homo sapiens (Human)
Description:P05556
Residue:798
Component 2
Name:Integrin alpha-4
Synonyms:CD49 antigen-like family member D CD49d antigen ITA4_HUMAN Integrin alpha-4 Integrin alpha-IV VLA-4 integrin alpha 4 precursor | integrin alpha-4 precursor
Type:Membrane Protein
Mol. Mass.:114897.35
Organism:Homo sapiens (Human)
Description:P13612
Residue:1032
BDBM50087624
NameBDBM50087624
Synonyms:2-[1-benzyl-2-oxo-(5S)-dihydro-1H-5-pyrrolylcarboxamido]-3-{4-[2-(4-hydroxyphenyl)-1-methylcarboxamido-(1R)-ethylcarboxamido]phenyl}-(2S)-propanoic acid | CHEMBL348792
TypeSmall organic molecule
Emp. Form.C32H34N4O7
Mol. Mass.586.635
SMILESCC(=O)N[C@H](Cc1ccc(O)cc1)C(=O)Nc1ccc(C[C@H](NC(=O)[C@@H]2CCC(=O)N2Cc2ccccc2)C(O)=O)cc1