Reaction Details
TargetIntegrin alpha-4/beta-1
LigandBDBM50128324
Substrate/Competitorn/a
Meas. Tech.ChEMBL_213389 (CHEMBL818047)
IC50 0.210000±n/a nM
Citation Doherty, GAYang, GXBorges, ETong, SMcCauley, EDTreonz, KMVan Riper, GPacholok, SSi, QKoo, GCShah, KMumford, RAHagmann, WK N-isonicotinoyl-(L)-4-aminophenylalanine derivatives as tight binding VLA-4 antagonists. Bioorg Med Chem Lett13:1891-5 (2003) Integrin alpha-4/beta-1
Name:Integrin alpha-4/beta-1
Type:n/a
Mol. Mass.:n/a
Description:ASSAY_ID of EBI is 88912
Components:This complex has 2 components.
Component 1
Name:Integrin beta-1
Synonyms:CD_antigen=CD29 Fibronectin receptor beta GPIIA ITGB1 MDF2 | MSK12
Type:Enzyme
Mol. Mass.:88400.38
Organism:Homo sapiens (Human)
Description:P05556
Residue:798
Component 2
Name:Integrin alpha-4
Synonyms:CD49 antigen-like family member D CD49d antigen ITA4_HUMAN Integrin alpha-4 Integrin alpha-IV VLA-4 integrin alpha 4 precursor | integrin alpha-4 precursor
Type:Membrane Protein
Mol. Mass.:114897.35
Organism:Homo sapiens (Human)
Description:P13612
Residue:1032
BDBM50128324
NameBDBM50128324
Synonyms:(S)-3-{4-[(4-Chloro-pyridine-3-carbonyl)-amino]-phenyl}-2-{[(S)-1-(3,5-dichloro-benzenesulfonyl)-2-methyl-pyrrolidine-2-carbonyl]-amino}-propionic acid | CHEMBL293756
TypeSmall organic molecule
Emp. Form.C27H25Cl3N4O6S
Mol. Mass.639.935
SMILESC[C@]1(CCCN1S(=O)(=O)c1cc(Cl)cc(Cl)c1)C(=O)N[C@@H](Cc1ccc(NC(=O)c2cnccc2Cl)cc1)C(O)=O