Reaction Details
TargetAcetylcholinesterase
LigandBDBM50135152
Substrate/Competitorn/a
Meas. Tech.ChEBML_29848
IC50 69183±n/a nM
Citation Zaheer-ul-Haq, naWellenzohn, BTonmunphean, SKhalid, AChoudhary, MIRode, BM 3D-QSAR studies on natural acetylcholinesterase inhibitors of Sarcococca saligna by comparative molecular field analysis (CoMFA). Bioorg Med Chem Lett13:4375-80 (2003) Acetylcholinesterase
Name:Acetylcholinesterase
Type:Enzyme
Mol. Mass.:67792.70
Organism:Homo sapiens (Human)
Description:P22303
Residue:614
BDBM50135152
NameBDBM50135152
Synonyms:CHEMBL422098 N-[(3S,5S,8R,9S,10S,13S,14S,17S)-17-(1-Dimethylamino-ethyl)-10-methyl-13-(S)-methyl-hexadecahydro-cyclopenta[a]phenanthren-3-yl]-acetamide
TypeSmall organic molecule
Emp. Form.C25H44N2O
Mol. Mass.388.6297
SMILESC[C@@H]([C@H]1CC[C@H]2[C@@H]3CC[C@H]4C[C@H](CC[C@]4(C)[C@H]3CC[C@]12C)NC(C)=O)N(C)C