Reaction Details
TargetAcetylcholinesterase
LigandBDBM50421623
Substrate/Competitorn/a
Meas. Tech.ChEBML_29848
IC50 48978±n/a nM
Citation Zaheer-ul-Haq, naWellenzohn, BTonmunphean, SKhalid, AChoudhary, MIRode, BM 3D-QSAR studies on natural acetylcholinesterase inhibitors of Sarcococca saligna by comparative molecular field analysis (CoMFA). Bioorg Med Chem Lett13:4375-80 (2003) Acetylcholinesterase
Name:Acetylcholinesterase
Type:Enzyme
Mol. Mass.:67792.70
Organism:Homo sapiens (Human)
Description:P22303
Residue:614
BDBM50421623
NameBDBM50421623
Synonyms:CHEMBL140241
TypeSmall organic molecule
Emp. Form.C24H37NO2
Mol. Mass.371.5561
SMILESCO[C@H]1CC[C@]2(C)[C@H]3CC[C@@]4(C)[C@@H](CC=C4[C@H](C)N(C)C=O)[C@@H]3CC=C2C1