Reaction Details
TargetAcetylcholinesterase
LigandBDBM50135147
Substrate/Competitorn/a
Meas. Tech.ChEBML_29848
IC50 5248±n/a nM
Citation Zaheer-ul-Haq, naWellenzohn, BTonmunphean, SKhalid, AChoudhary, MIRode, BM 3D-QSAR studies on natural acetylcholinesterase inhibitors of Sarcococca saligna by comparative molecular field analysis (CoMFA). Bioorg Med Chem Lett13:4375-80 (2003) Acetylcholinesterase
Name:Acetylcholinesterase
Type:Enzyme
Mol. Mass.:67792.70
Organism:Homo sapiens (Human)
Description:P22303
Residue:614
BDBM50135147
NameBDBM50135147
Synonyms:(+)-axillaridine A CHEMBL335133 | N-[(5R,8S,9S,10R,13S,14S,17S)-17-((S)-1-Dimethylamino-ethyl)-10,13-dimethyl-4-oxo-4,5,6,7,8,9,10,11,12,13,14,15,16,17-tetradecahydro-1H-cyclopenta[a]phenanthren-3-yl]-benzamide
TypeSmall organic molecule
Emp. Form.C30H42N2O2
Mol. Mass.462.6667
SMILESC[C@@H]([C@H]1CC[C@H]2[C@@H]3CC[C@H]4C(=O)C(NC(=O)c5ccccc5)=CC[C@]4(C)[C@H]3CC[C@]12C)N(C)C