Reaction Details
TargetAcetylcholinesterase
LigandBDBM50421624
Substrate/Competitorn/a
Meas. Tech.ChEBML_29848
IC50 50119±n/a nM
Citation Zaheer-ul-Haq, naWellenzohn, BTonmunphean, SKhalid, AChoudhary, MIRode, BM 3D-QSAR studies on natural acetylcholinesterase inhibitors of Sarcococca saligna by comparative molecular field analysis (CoMFA). Bioorg Med Chem Lett13:4375-80 (2003) Acetylcholinesterase
Name:Acetylcholinesterase
Type:Enzyme
Mol. Mass.:67792.70
Organism:Homo sapiens (Human)
Description:P22303
Residue:614
BDBM50421624
NameBDBM50421624
Synonyms:CHEMBL136052
TypeSmall organic molecule
Emp. Form.C26H46N2O
Mol. Mass.402.6562
SMILESC[C@@H]([C@H]1CC[C@H]2[C@@H]3CC[C@H]4C[C@H](CC[C@]4(C)[C@H]3CC[C@]12C)N(C)C)N(C)C(C)=O