Reaction Details
TargetAcetylcholinesterase
LigandBDBM50421625
Substrate/Competitorn/a
Meas. Tech.ChEBML_29848
IC50 13804±n/a nM
Citation Zaheer-ul-Haq, naWellenzohn, BTonmunphean, SKhalid, AChoudhary, MIRode, BM 3D-QSAR studies on natural acetylcholinesterase inhibitors of Sarcococca saligna by comparative molecular field analysis (CoMFA). Bioorg Med Chem Lett13:4375-80 (2003) Acetylcholinesterase
Name:Acetylcholinesterase
Type:Enzyme
Mol. Mass.:67792.70
Organism:Homo sapiens (Human)
Description:P22303
Residue:614
BDBM50421625
NameBDBM50421625
Synonyms:CHEMBL136135
TypeSmall organic molecule
Emp. Form.C28H44N2O2
Mol. Mass.440.6612
SMILESC\C=C(/C)C(=O)NC1=CC[C@]2(C)[C@H]3CC[C@]4(C)[C@H](CCC4[C@@H]3CC[C@H]2C1=O)[C@H](C)N(C)C