Reaction Details
TargetAcetylcholinesterase
LigandBDBM50421626
Substrate/Competitorn/a
Meas. Tech.ChEBML_29848
IC50 6166±n/a nM
Citation Zaheer-ul-Haq, naWellenzohn, BTonmunphean, SKhalid, AChoudhary, MIRode, BM 3D-QSAR studies on natural acetylcholinesterase inhibitors of Sarcococca saligna by comparative molecular field analysis (CoMFA). Bioorg Med Chem Lett13:4375-80 (2003) Acetylcholinesterase
Name:Acetylcholinesterase
Type:Enzyme
Mol. Mass.:67792.70
Organism:Homo sapiens (Human)
Description:P22303
Residue:614
BDBM50421626
NameBDBM50421626
Synonyms:CHEMBL139685
TypeSmall organic molecule
Emp. Form.C24H44N2
Mol. Mass.360.6196
SMILESCN[C@H]1CC[C@@]2(C)C(CC[C@H]3[C@@H]4CC[C@H]([C@H](C)N(C)C)[C@@]4(C)CC[C@H]23)C1