Reaction Details
TargetAcetylcholinesterase
LigandBDBM50135159
Substrate/Competitorn/a
Meas. Tech.ChEBML_29848
IC50 19498±n/a nM
Citation Zaheer-ul-Haq, naWellenzohn, BTonmunphean, SKhalid, AChoudhary, MIRode, BM 3D-QSAR studies on natural acetylcholinesterase inhibitors of Sarcococca saligna by comparative molecular field analysis (CoMFA). Bioorg Med Chem Lett13:4375-80 (2003) Acetylcholinesterase
Name:Acetylcholinesterase
Type:Enzyme
Mol. Mass.:67792.70
Organism:Homo sapiens (Human)
Description:P22303
Residue:614
BDBM50135159
NameBDBM50135159
Synonyms:(20S,2'E)-20-(N,N-dimethylamino)-3beta-(3'-phenyl-2'-propenyl-N-methylamido)pregnane] (E)-N-{(1S,6S,7S,11R,12S,15S,16S)-17-[(S)-1-((S)-Dimethyl-amino)-ethyl]-10,13-dimethyl-hexadecahydro-cyclopenta[a]phenanthren-3-yl}-N-methyl-3-phenyl-acrylamide | CHEMBL409854
TypeSmall organic molecule
Emp. Form.C33H50N2O
Mol. Mass.490.7629
SMILESC[C@@H]([C@H]1CC[C@H]2[C@@H]3CC[C@H]4C[C@H](CC[C@]4(C)[C@H]3CC[C@]12C)N(C)C(=O)\C=C\c1ccccc1)N(C)C