Reaction Details
TargetAcetylcholinesterase
LigandBDBM50135153
Substrate/Competitorn/a
Meas. Tech.ChEBML_29848
IC50 6457±n/a nM
Citation Zaheer-ul-Haq, naWellenzohn, BTonmunphean, SKhalid, AChoudhary, MIRode, BM 3D-QSAR studies on natural acetylcholinesterase inhibitors of Sarcococca saligna by comparative molecular field analysis (CoMFA). Bioorg Med Chem Lett13:4375-80 (2003) Acetylcholinesterase
Name:Acetylcholinesterase
Type:Enzyme
Mol. Mass.:67792.70
Organism:Homo sapiens (Human)
Description:P22303
Residue:614
BDBM50135153
NameBDBM50135153
Synonyms:(E)-3,4-Dimethyl-pent-2-enoic acid [(3S,5S,8R,9S,10S,13S,14S,17S)-17-((S)-1-dimethylamino-ethyl)-10,13-dimethyl-hexadecahydro-cyclopenta[a]phenanthren-3-yl]-methyl-amide CHEMBL344593
TypeSmall organic molecule
Emp. Form.C31H54N2O
Mol. Mass.470.7733
SMILESCC(C)C(\C)=C\C(=O)N(C)[C@H]1CC[C@@]2(C)[C@@H](CC[C@H]3[C@@H]4CC[C@H]([C@H](C)N(C)C)[C@@]4(C)CC[C@H]23)C1