Reaction Details
TargetAcetylcholinesterase
LigandBDBM50135148
Substrate/Competitorn/a
Meas. Tech.ChEBML_29848
IC50 6166±n/a nM
Citation Zaheer-ul-Haq, naWellenzohn, BTonmunphean, SKhalid, AChoudhary, MIRode, BM 3D-QSAR studies on natural acetylcholinesterase inhibitors of Sarcococca saligna by comparative molecular field analysis (CoMFA). Bioorg Med Chem Lett13:4375-80 (2003) Acetylcholinesterase
Name:Acetylcholinesterase
Type:Enzyme
Mol. Mass.:67792.70
Organism:Homo sapiens (Human)
Description:P22303
Residue:614
BDBM50135148
NameBDBM50135148
Synonyms:1N-[14-(1-dimethylaminoethyl)-2,15-dimethyl-(1S,7S,10R,11S)-tetracyclo[8.7.0.02,7.011,15]heptadec-13-en-5-yl]-1N,3,4-trimethyl-(E)-2-pentenamide CHEMBL424100
TypeSmall organic molecule
Emp. Form.C31H52N2O
Mol. Mass.468.7574
SMILESCC(C)C(\C)=C\C(=O)N(C)[C@H]1CC[C@@]2(C)[C@@H](CC[C@H]3[C@@H]4CC=C([C@H](C)N(C)C)[C@@]4(C)CC[C@H]23)C1