Reaction Details
TargetAcetylcholinesterase
LigandBDBM50421628
Substrate/Competitorn/a
Meas. Tech.ChEBML_29848
IC50 39811±n/a nM
Citation Zaheer-ul-Haq, naWellenzohn, BTonmunphean, SKhalid, AChoudhary, MIRode, BM 3D-QSAR studies on natural acetylcholinesterase inhibitors of Sarcococca saligna by comparative molecular field analysis (CoMFA). Bioorg Med Chem Lett13:4375-80 (2003) Acetylcholinesterase
Name:Acetylcholinesterase
Type:Enzyme
Mol. Mass.:67792.70
Organism:Homo sapiens (Human)
Description:P22303
Residue:614
BDBM50421628
NameBDBM50421628
Synonyms:CHEMBL344384
TypeSmall organic molecule
Emp. Form.C25H44N2
Mol. Mass.372.6303
SMILESC[C@@H]([C@H]1CC[C@H]2[C@@H]3CC=C4C[C@H](CC[C@]4(C)[C@H]3CC[C@]12C)N(C)C)N(C)C