Reaction Details
TargetAcetylcholinesterase
LigandBDBM50421629
Substrate/Competitorn/a
Meas. Tech.ChEBML_29848
IC50 33113±n/a nM
Citation Zaheer-ul-Haq, naWellenzohn, BTonmunphean, SKhalid, AChoudhary, MIRode, BM 3D-QSAR studies on natural acetylcholinesterase inhibitors of Sarcococca saligna by comparative molecular field analysis (CoMFA). Bioorg Med Chem Lett13:4375-80 (2003) Acetylcholinesterase
Name:Acetylcholinesterase
Type:Enzyme
Mol. Mass.:67792.70
Organism:Homo sapiens (Human)
Description:P22303
Residue:614
BDBM50421629
NameBDBM50421629
Synonyms:CHEMBL337494
TypeSmall organic molecule
Emp. Form.C28H46N2O3
Mol. Mass.458.6764
SMILESC\C=C(/C)C(=O)N[C@H]1[C@@H](O)C[C@@]2(C)C(CC[C@@H]3[C@@H]2CC[C@]2(C)[C@H](CC=C32)[C@H](C)N(C)C)[C@H]1O