Reaction Details
TargetAcetylcholinesterase
LigandBDBM50421630
Substrate/Competitorn/a
Meas. Tech.ChEBML_29848
IC50 7762±n/a nM
Citation Zaheer-ul-Haq, naWellenzohn, BTonmunphean, SKhalid, AChoudhary, MIRode, BM 3D-QSAR studies on natural acetylcholinesterase inhibitors of Sarcococca saligna by comparative molecular field analysis (CoMFA). Bioorg Med Chem Lett13:4375-80 (2003) Acetylcholinesterase
Name:Acetylcholinesterase
Type:Enzyme
Mol. Mass.:67792.70
Organism:Homo sapiens (Human)
Description:P22303
Residue:614
BDBM50421630
NameBDBM50421630
Synonyms:CHEMBL136251
TypeSmall organic molecule
Emp. Form.C28H44N2O
Mol. Mass.424.6618
SMILESC\C=C(/C)C(=O)N[C@H]1CC[C@]2(C)[C@H]3CC[C@]4(C)[C@H](CC=C4[C@@H]3CCC2=C1)[C@H](C)N(C)C