Reaction Details
TargetAcetylcholinesterase
LigandBDBM50242345
Substrate/Competitorn/a
Meas. Tech.ChEBML_29848
IC50 5248±n/a nM
Citation Zaheer-ul-Haq, naWellenzohn, BTonmunphean, SKhalid, AChoudhary, MIRode, BM 3D-QSAR studies on natural acetylcholinesterase inhibitors of Sarcococca saligna by comparative molecular field analysis (CoMFA). Bioorg Med Chem Lett13:4375-80 (2003) Acetylcholinesterase
Name:Acetylcholinesterase
Type:Enzyme
Mol. Mass.:67792.70
Organism:Homo sapiens (Human)
Description:P22303
Residue:614
BDBM50242345
NameBDBM50242345
Synonyms:CHEMBL460447 | [(20S)-20-(N,N-dimethylamino)-3 beta-(senecioylamino)-5 alpha-pregn-16-en-4 beta-yl acetate]
TypeSmall organic molecule
Emp. Form.C30H48N2O3
Mol. Mass.484.7137
SMILES[#6]-[#6@H](-[#7](-[#6])-[#6])-[#6]1=[#6]-[#6]-[#6@H]2-[#6@@H]-3-[#6]-[#6]-[#6@H]4-[#6@@H](-[#8]-[#6](-[#6])=O)-[#6@H](-[#6]-[#6][C@]4([#6])[#6@H]-3-[#6]-[#6][C@]12[#6])-[#7]-[#6](=O)\[#6]=[#6](/[#6])-[#6]