Reaction Details
TargetAcetylcholinesterase
LigandBDBM50421632
Substrate/Competitorn/a
Meas. Tech.ChEBML_29848
IC50 50119±n/a nM
Citation Zaheer-ul-Haq, naWellenzohn, BTonmunphean, SKhalid, AChoudhary, MIRode, BM 3D-QSAR studies on natural acetylcholinesterase inhibitors of Sarcococca saligna by comparative molecular field analysis (CoMFA). Bioorg Med Chem Lett13:4375-80 (2003) Acetylcholinesterase
Name:Acetylcholinesterase
Type:Enzyme
Mol. Mass.:67792.70
Organism:Homo sapiens (Human)
Description:P22303
Residue:614
BDBM50421632
NameBDBM50421632
Synonyms:CHEMBL342245
TypeSmall organic molecule
Emp. Form.C32H50N2O5
Mol. Mass.542.7498
SMILESC\C=C(/C)C(=O)N[C@H]1C(C[C@]2(C)[C@H]3CC[C@@]4(C)C(CC=C4[C@H](C)N(C)C)[C@@H]3CCC2[C@H]1OC(C)=O)OC(C)=O