Reaction Details
TargetAcetylcholinesterase
LigandBDBM50135146
Substrate/Competitorn/a
Meas. Tech.ChEBML_29848
IC50 5754±n/a nM
Citation Zaheer-ul-Haq, naWellenzohn, BTonmunphean, SKhalid, AChoudhary, MIRode, BM 3D-QSAR studies on natural acetylcholinesterase inhibitors of Sarcococca saligna by comparative molecular field analysis (CoMFA). Bioorg Med Chem Lett13:4375-80 (2003) Acetylcholinesterase
Name:Acetylcholinesterase
Type:Enzyme
Mol. Mass.:67792.70
Organism:Homo sapiens (Human)
Description:P22303
Residue:614
BDBM50135146
NameBDBM50135146
Synonyms:(E)-2-Methyl-but-2-enoic acid [(3S,8R,9S,10R,13R,17S)-17-((S)-1-dimethylamino-ethyl)-10,13-dimethyl-4-oxo-2,3,4,7,8,9,10,11,12,13,16,17-dodecahydro-1H-cyclopenta[a]phenanthren-3-yl]-amide | CHEMBL137039
TypeSmall organic molecule
Emp. Form.C28H42N2O2
Mol. Mass.438.6453
SMILESC\C=C(/C)C(=O)N[C@H]1CC[C@]2(C)[C@H]3CC[C@]4(C)[C@H](CC=C4[C@@H]3CC=C2C1=O)[C@H](C)N(C)C