Reaction Details
TargetAcetylcholinesterase
LigandBDBM50135156
Substrate/Competitorn/a
Meas. Tech.ChEBML_29848
IC50 61660±n/a nM
Citation Zaheer-ul-Haq, naWellenzohn, BTonmunphean, SKhalid, AChoudhary, MIRode, BM 3D-QSAR studies on natural acetylcholinesterase inhibitors of Sarcococca saligna by comparative molecular field analysis (CoMFA). Bioorg Med Chem Lett13:4375-80 (2003) Acetylcholinesterase
Name:Acetylcholinesterase
Type:Enzyme
Mol. Mass.:67792.70
Organism:Homo sapiens (Human)
Description:P22303
Residue:614
BDBM50135156
NameBDBM50135156
Synonyms:Acetic acid (2S,3S,4R,5R,8R,9S,10R,13R,17S)-17-((S)-1-dimethylamino-ethyl)-2-hydroxy-10,13-dimethyl-3-((E)-2-methyl-but-2-enoylamino)-2,3,4,5,6,7,8,9,10,11,12,13,16,17-tetradecahydro-1H-cyclopenta[a]phenanthren-4-yl ester | CHEMBL343054
TypeSmall organic molecule
Emp. Form.C30H48N2O4
Mol. Mass.500.7131
SMILESC\C=C(/C)C(=O)N[C@H]1[C@@H](O)C[C@]2(C)[C@H]3CC[C@]4(C)[C@H](CC=C4[C@@H]3CC[C@H]2[C@H]1OC(C)=O)[C@H](C)N(C)C