Reaction Details
TargetAcetylcholinesterase
LigandBDBM50421635
Substrate/Competitorn/a
Meas. Tech.ChEBML_29848
IC50 30200±n/a nM
Citation Zaheer-ul-Haq, naWellenzohn, BTonmunphean, SKhalid, AChoudhary, MIRode, BM 3D-QSAR studies on natural acetylcholinesterase inhibitors of Sarcococca saligna by comparative molecular field analysis (CoMFA). Bioorg Med Chem Lett13:4375-80 (2003) Acetylcholinesterase
Name:Acetylcholinesterase
Type:Enzyme
Mol. Mass.:67792.70
Organism:Homo sapiens (Human)
Description:P22303
Residue:614
BDBM50421635
NameBDBM50421635
Synonyms:CHEMBL2368067
TypeSmall organic molecule
Emp. Form.C28H46N2O2
Mol. Mass.442.677
SMILES[H][C@@](C)(N(C)C)[C@@]1([H])CC[C@@]2([H])[C@]3([H])CC=C4[C@@H](O)[C@H](CC[C@]4(C)[C@@]3([H])CC[C@]12C)NC(=O)C(\C)=C\C